Target
Beta-1 adrenergic receptor
Ligand
BDBM50017384
Substrate
Meas. Tech.
ChEBML_39187
IC50
12000±n/a nM
Citation
 Jamart-Gregoire, BCaubere, PBlanc, MGnassounou, JPAdvenier, C A new series of tricyclic (aryloximino)propanolamines displaying very high selective beta 2-blocking properties. J Med Chem 32:315-20 (1989)  
Target
Name:
Beta-1 adrenergic receptor
Synonyms:
ADRB1 adrenergic Beta1
Type:
Enzyme Catalytic Domain
Mol. Mass.:
50540.48
Organism:
GUINEA PIG
Description:
adrenergic Beta1 ADRB1 GUINEA PIG::B0FL73
Residue:
467
  
Inhibitor
Name:
BDBM50017384
Synonyms:
9a-Methoxy-1,2,3,4,4a,9a-hexahydro-fluoren-9-one O-(3-tert-butylamino-2-hydroxy-propyl)-oxime | CHEMBL320761
Type:
Small organic molecule
Emp. Form.:
C21H32N2O3
Mol. Mass.:
360.4904
SMILES:
COC12CCCCC1c1ccccc1\C2=N\OCC(O)CNC(C)(C)C
: