Target
Beta-1 adrenergic receptor
Ligand
BDBM50017378
Substrate
Meas. Tech.
ChEBML_39187
IC50
>100000±n/a nM
Citation
 Jamart-Gregoire, BCaubere, PBlanc, MGnassounou, JPAdvenier, C A new series of tricyclic (aryloximino)propanolamines displaying very high selective beta 2-blocking properties. J Med Chem 32:315-20 (1989)  
Target
Name:
Beta-1 adrenergic receptor
Synonyms:
ADRB1 adrenergic Beta1
Type:
Enzyme Catalytic Domain
Mol. Mass.:
50540.48
Organism:
GUINEA PIG
Description:
adrenergic Beta1 ADRB1 GUINEA PIG::B0FL73
Residue:
467
  
Inhibitor
Name:
BDBM50017378
Synonyms:
9a-(2-Hydroxy-ethoxy)-1,2,3,4,4a,9a-hexahydro-fluoren-9-one O-(2-hydroxy-3-isopropylamino-propyl)-oxime | CHEMBL419741
Type:
Small organic molecule
Emp. Form.:
C21H32N2O4
Mol. Mass.:
376.4898
SMILES:
CC(C)NCC(O)CO\N=C1\c2ccccc2C2CCCCC12OCCO
: