Target
Stromelysin-2
Ligand
BDBM50324120
Substrate
Meas. Tech.
ChEBML_1734200
IC50
>10000±n/a nM
Citation
 de Miguel, IOrbe, JSánchez-Arias, JARodríguez, JASalicio, ARabal, OBelzunce, MSáez, EXu, MWu, WTan, HMa, HPáramo, JAOyarzabal, J Phenotypic Screening To Discover Novel Chemical Series as Efficient Antihemorrhagic Agents. ACS Med Chem Lett 9:428-433 (2018)  
Target
Name:
Stromelysin-2
Synonyms:
MMP10 Matrix Metalloproteinase-10 (MMP-10) STMY2
Type:
Enzyme
Mol. Mass.:
54143.02
Organism:
Homo sapiens (Human)
Description:
P09238
Residue:
476
  
Inhibitor
Name:
BDBM50324120
Synonyms:
CHEMBL4176634
Type:
Small organic molecule
Emp. Form.:
C29H29ClF3N3O5S
Mol. Mass.:
624.071
SMILES:
Nc1ccccc1NC(=O)C1(CCC2(C1)CCNCC2)S(=O)(=O)c1ccc(Oc2ccc(OC(F)(F)F)cc2)c(Cl)c1
: