Target
Cytochrome P450 3A4
Ligand
BDBM50443541
Substrate
Meas. Tech.
ChEBML_1734268
IC50
>12000±n/a nM
Citation
 Tahirovic, YATruax, VMWilson, RJJecs, ENguyen, HHMiller, EJKim, MBKuo, KMWang, TSum, CSCvijic, MESchroeder, GMWilson, LJLiotta, DC Discovery of  ACS Med Chem Lett 9:446-451 (2018)  
Target
Name:
Cytochrome P450 3A4
Synonyms:
Albendazole monooxygenase CP3A4_HUMAN CYP3A4 CYPIIIA4 Cytochrome P450 3A4 (CYP3A4) Nifedipine oxidase Taurochenodeoxycholate 6-alpha-hydroxylase
Type:
Enzyme
Mol. Mass.:
57349.57
Organism:
Homo sapiens (Human)
Description:
Residue:
503
  
Inhibitor
Name:
BDBM50443541
Synonyms:
CHEMBL3091687
Type:
Small organic molecule
Emp. Form.:
C23H32N4
Mol. Mass.:
364.527
SMILES:
NCCCCN(C[C@H]1Cc2ccccc2CN1)[C@H]1CCCc2cccnc12
: