Target
Sodium- and chloride-dependent glycine transporter 1
Ligand
BDBM50366249
Substrate
Meas. Tech.
ChEMBL_1735183 (CHEMBL4150719)
Ki
24.0±n/a nM
Citation
 Wang, YZhao, HBrewer, JTLi, HLao, YAmberg, WBehl, BAkritopoulou-Zanze, IDietrich, JLange, UEWPohlki, FHoft, CHornberger, WDjuric, SWSydor, JMezler, MRelo, ALVasudevan, A De Novo Design, Synthesis, and Biological Evaluation of 3,4-Disubstituted Pyrrolidine Sulfonamides as Potent and Selective Glycine Transporter 1 Competitive Inhibitors. J Med Chem 61:7486-7502 (2018)  
Target
Name:
Sodium- and chloride-dependent glycine transporter 1
Synonyms:
GlyT-1 Glycine Transporters (GlyT1c) SC6A9_HUMAN Sodium- and chloride-dependent glycine transporter 1 Sodium- and chloride-dependent glycine transporter 1 (GlyT1c) Solute carrier family 6 member 9
Type:
Enzyme
Mol. Mass.:
78270.54
Organism:
Homo sapiens (Human)
Description:
P48067
Residue:
706
  
Inhibitor
Name:
BDBM50366249
Synonyms:
CHEMBL4171068
Type:
Small organic molecule
Emp. Form.:
C19H23F3N4O4S
Mol. Mass.:
460.471
SMILES:
[H][C@]1(CCCO1)[C@@]1([H])CN(C[C@@H]1Nc1cccc(OC(F)(F)F)c1)S(=O)(=O)c1cn(C)cn1
: