Target
Phospholipase A2, membrane associated
Ligand
BDBM50055366
Substrate
Meas. Tech.
ChEMBL_1735579 (CHEMBL4151115)
IC50
12±n/a nM
Citation
 Knerr, LGiordanetto, FNordberg, PPettersen, DSelmi, NBeisel, HGde la Motte, HOlsson, TPerkins, TDJHerslöf, MMånsson, ÅDahlström, MStarke, IBroddefalk, JSaarinen, GKlingegård, FHurt-Camejo, ERosengren, BBrengdahl, JJansen, FRohman, MSandmark, JHallberg, KÅkerud, TRoth, RGAhlqvist, M Discovery of a Series of Indole-2 Carboxamides as Selective Secreted Phospholipase A ACS Med Chem Lett 9:594-599 (2018)  
Target
Name:
Phospholipase A2, membrane associated
Synonyms:
GIIC sPLA2 NPS-PLA2 Non-pancreatic secretory phospholipase A2 (hnps-PLA2) PLA2B PLA2L Phospholipase A2 group IIA | RASF-A
Type:
Hydrolase
Mol. Mass.:
16101.20
Organism:
Homo sapiens (Human)
Description:
The human nps PLA2 was cloned, and expressed in E. coli. There was a refolding process in the purification.
Residue:
144
  
Inhibitor
Name:
BDBM50055366
Synonyms:
(3-Aminooxalyl-1-benzyl-2-ethyl-1H-indol-4-yloxy)-acetic acid 2-(3-(2-amino-2-oxoacetyl)-1-benzyl-2-ethyl-1H-indol-4-yloxy)acetic acid Varespladib sodium
Type:
Small organic molecule
Emp. Form.:
C21H20N2O5
Mol. Mass.:
380.3939
SMILES:
CCc1c(C(=O)C(N)=O)c2c(OCC(O)=O)cccc2n1Cc1ccccc1
: