Target
Peroxisomal N(1)-acetyl-spermine/spermidine oxidase
Ligand
BDBM50405930
Substrate
Meas. Tech.
ChEBML_141590
Ki
130000±n/a nM
Citation
 Dredar, SABlankenship, JWMarchant, PEManneh, VFries, DS Design and synthesis of inhibitors of N8-acetylspermidine deacetylase. J Med Chem 32:984-9 (1989)  
Target
Name:
Peroxisomal N(1)-acetyl-spermine/spermidine oxidase
Synonyms:
Acetylpolyamine oxidase (APAO) PAOX Peroxisomal N(1)-acetyl-spermine/spermidine oxidase | Polyamine oxidase
Type:
Enzyme
Mol. Mass.:
70274.33
Organism:
Homo sapiens (Human)
Description:
Q6QHF9
Residue:
649
  
Inhibitor
Name:
BDBM50405930
Synonyms:
CHEMBL174887
Type:
Small organic molecule
Emp. Form.:
C8H17ClN2O
Mol. Mass.:
192.686
SMILES:
NCCCCCCNC(=O)CCl
: