Target
Cholecystokinin receptor type A
Ligand
BDBM50018060
Substrate
Meas. Tech.
ChEBML_49396
Ki
2500±n/a nM
Citation
 Charpentier, BDor, ARoy, PEngland, PPham, HDurieux, CRoques, BP Synthesis and binding affinities of cyclic and related linear analogues of CCK8 selective for central receptors. J Med Chem 32:1184-90 (1989)  
Target
Name:
Cholecystokinin receptor type A
Synonyms:
CCK-A receptor CCK1-R CCKAR_CAVPO Cholecystokinin receptor type A | Cholecystokinin-1 receptor
Type:
Mol. Mass.:
48229.77
Organism:
Cavia porcellus
Description:
Residue:
430
  
Inhibitor
Name:
BDBM50018060
Synonyms:
Boc-cyclo-(gama-D-Glu-Tyr(SO3H)-Nle-D-Lys)-Trp-Nle-Asp-Phe-NH2 | CHEMBL264273
Type:
Small organic molecule
Emp. Form.:
C61H83N11O17S
Mol. Mass.:
1274.44
SMILES:
CCCC[C@H](NC(=O)[C@H](Cc1c[nH]c2ccccc12)NC(=O)[C@@H]1CCCCNC(=O)[C@@H](CCC(=O)N[C@H](Cc2ccc(OS(O)(=O)=O)cc2)C(=O)N[C@@H](CCCC)C(=O)N1)NC(=O)OC(C)(C)C)C(=O)N[C@@H](CC(O)=O)C(=O)N[C@H](Cc1ccccc1)C(N)=O
: