Target
Adenosine receptor A1
Ligand
BDBM50001500
Substrate
Meas. Tech.
ChEMBL_29620 (CHEMBL639642)
Ki
3400±n/a nM
Citation
 Shamim, MTUkena, DPadgett, WLDaly, JW Effects of 8-phenyl and 8-cycloalkyl substituents on the activity of mono-, di-, and trisubstituted alkylxanthines with substitution at the 1-, 3-, and 7-positions. J Med Chem 32:1231-7 (1989)  
Target
Name:
Adenosine receptor A1
Synonyms:
AA1R_RAT ADENOSINE A1 high Adenosine A1 receptor (A1) Adenosine receptors A1 | Adora1
Type:
Protein
Mol. Mass.:
36704.13
Organism:
Rattus norvegicus (rat)
Description:
Residue:
326
  
Inhibitor
Name:
BDBM50001500
Synonyms:
7-Methyl-1,3-dipropyl-3,7-dihydro-purine-2,6-dione | CHEMBL278332
Type:
Small organic molecule
Emp. Form.:
C12H18N4O2
Mol. Mass.:
250.2969
SMILES:
CCCn1c2ncn(C)c2c(=O)n(CCC)c1=O
: