Target
Dual specificity tyrosine-phosphorylation-regulated kinase 1A
Ligand
BDBM209414
Substrate
Meas. Tech.
ChEMBL_1736321 (CHEMBL4151857)
Ki
2015±n/a nM
Citation
 Czarna, AWang, JZelencova, DLiu, YDeng, XChoi, HGZhang, TZhou, WChang, JWKildalsen, HSeternes, OMGray, NSEngh, RARothweiler, U Novel Scaffolds for Dual Specificity Tyrosine-Phosphorylation-Regulated Kinase (DYRK1A) Inhibitors. J Med Chem 61:7560-7572 (2018)  
Target
Name:
Dual specificity tyrosine-phosphorylation-regulated kinase 1A
Synonyms:
DYR1A_HUMAN DYRK1A Dual specificity YAK1-related kinase 1A (Dyrk1A) Dual-specificity tyrosine-phosphorylation regulated kinase 1A HP86 MNBH
Type:
Enzyme
Mol. Mass.:
85616.61
Organism:
Homo sapiens (Human)
Description:
Q13627
Residue:
763
  
Inhibitor
Name:
BDBM209414
Synonyms:
US9266890, I-24
Type:
Small organic molecule
Emp. Form.:
C23H28N6O2
Mol. Mass.:
420.5074
SMILES:
CN1c2cnc(Nc3ccc(cc3)C(N)=O)nc2N(C2CCCC2)[C@@H]2CCC[C@@H]2C1=O
: