Target
Stromal cell-derived factor 1
Ligand
BDBM50369279
Substrate
Meas. Tech.
ChEMBL_1736458 (CHEMBL4151994)
Ki
267±n/a nM
Citation
 Regenass, PAbboud, DDaubeuf, FLehalle, CGizzi, PRiché, SHachet-Haas, MRohmer, FGasparik, VBoeglin, DHaiech, JKnehans, TRognan, DHeissler, DMarsol, CVilla, PGalzi, JLHibert, MFrossard, NBonnet, D Discovery of a Locally and Orally Active CXCL12 Neutraligand (LIT-927) with Anti-inflammatory Effect in a Murine Model of Allergic Airway Hypereosinophilia. J Med Chem 61:7671-7686 (2018)  
Target
Name:
Stromal cell-derived factor 1
Synonyms:
CXCL12 SDF1 SDF1B | SDF1_HUMAN
Type:
Enzyme
Mol. Mass.:
10677.83
Organism:
Homo sapiens (Human)
Description:
P48061
Residue:
93
  
Inhibitor
Name:
BDBM50369279
Synonyms:
CHEMBL4166454
Type:
Small organic molecule
Emp. Form.:
C17H13ClN2O3
Mol. Mass.:
328.75
SMILES:
COc1cc(ccc1O)-c1cc(nc(=O)[nH]1)-c1ccc(Cl)cc1
: