Target
Neprilysin
Ligand
BDBM50405949
Substrate
Meas. Tech.
ChEBML_144458
IC50
3±n/a nM
Citation
 Xie, JSoleilhac, JMSchmidt, CPeyroux, JRoques, BPFournié-Zaluski, MC New kelatorphan-related inhibitors of enkephalin metabolism: improved antinociceptive properties. J Med Chem 32:1497-503 (1989)  
Target
Name:
Neprilysin
Synonyms:
Atriopeptidase CD_antigen=CD10 MME NEP_RABIT Neutral endopeptidase 24.11
Type:
Enzyme
Mol. Mass.:
85570.75
Organism:
Oryctolagus cuniculus (rabbit)
Description:
NEP was purified to homogeneity from rabbit kidney.
Residue:
750
  
Inhibitor
Name:
BDBM50405949
Synonyms:
CHEMBL2114408
Type:
Small organic molecule
Emp. Form.:
C21H24N2O5
Mol. Mass.:
384.4257
SMILES:
ONC(=O)C[C@@H](Cc1ccccc1)C(=O)N[C@H](CC(O)=O)Cc1ccccc1
: