Target
Dihydrofolate reductase
Ligand
BDBM50018476
Substrate
Meas. Tech.
ChEMBL_53149 (CHEMBL665869)
Ki
3±n/a nM
Citation
 Roth, BTidwell, MYFerone, RBaccanari, DPSigel, CWDeAngelis, DElwell, LP 2,4-Diamino-5-benzylpyrimidines as antibacterial agents. 13. Some alkenyl derivatives with high in vitro activity against anaerobic organisms. J Med Chem 32:1949-58 (1989)  
Target
Name:
Dihydrofolate reductase
Synonyms:
DYR_STAAU Dihydrofolate reductase Tetrahydrofolate dehydrogenase | folA
Type:
Enzyme
Mol. Mass.:
18249.71
Organism:
Staphylococcus aureus
Description:
Residue:
159
  
Inhibitor
Name:
BDBM50018476
Synonyms:
5-(3-Allyloxy-4,5-dimethoxy-benzyl)-pyrimidine-2,4-diamine | CHEMBL59946
Type:
Small organic molecule
Emp. Form.:
C16H20N4O3
Mol. Mass.:
316.355
SMILES:
COc1cc(Cc2cnc(N)nc2N)cc(OCC=C)c1OC
: