Target
Alpha-2A adrenergic receptor
Ligand
BDBM50018739
Substrate
Meas. Tech.
ChEMBL_33042 (CHEMBL858268)
Ki
4.3±n/a nM
Citation
 Huff, JRBaldwin, JJdeSolms, SJGuare, JPHunt, CARandall, WCSanders, WSSmith, SJVacca, JPZrada, MM Structure-affinity relationships of arylquinolizines at alpha-adrenoceptors. J Med Chem 31:641-5 (1988)  
Target
Name:
Alpha-2A adrenergic receptor
Synonyms:
ADA2A_BOVIN Alpha-2A adrenergic receptor Alpha-2A adrenoreceptor Alpha-2D adrenergic receptor Cerebral cortex alpha adrenergic receptor adrenergic Alpha2D
Type:
Enzyme Catalytic Domain
Mol. Mass.:
49275.13
Organism:
BOVINE
Description:
adrenergic Alpha2 0 BOVINE::Q28838
Residue:
452
  
Inhibitor
Name:
BDBM50018739
Synonyms:
1,3,4,5,6,11b-Hexahydro-2H-11-thia-4a-aza-benzo[a]fluorene | CHEMBL346492
Type:
Small organic molecule
Emp. Form.:
C15H17NS
Mol. Mass.:
243.367
SMILES:
C1CCN2CCc3c(sc4ccccc34)C2C1
: