Target
Sigma intracellular receptor 2
Ligand
BDBM50035105
Substrate
Meas. Tech.
ChEMBL_1742999 (CHEMBL4158749)
Ki
0.120000±n/a nM
Citation
 Bergkemper, MKronenberg, EThum, SBörgel, FDaniliuc, CSchepmann, DNieto, FRBrust, PReinoso, RFAlvarez, IWünsch, B Synthesis, Receptor Affinity, and Antiallodynic Activity of Spirocyclic ? Receptor Ligands with Exocyclic Amino Moiety. J Med Chem 61:9666-9690 (2018)  
Target
Name:
Sigma intracellular receptor 2
Synonyms:
S2r Sigma intracellular receptor 2 Sigma2 receptor Transmembrane protein 97
Type:
Protein
Mol. Mass.:
20953.88
Organism:
Rattus norvegicus (Rat)
Description:
Q5U3Y7
Residue:
176
  
Inhibitor
Name:
BDBM50035105
Synonyms:
1'-{4-[1-(4-fluorophenyl)-1H-3-indolyl]butyl}spiro[1,3-dihydroisobenzofuran-1,4'-(hexahydropyridine)] CHEMBL61479 Siramesine
Type:
Small organic molecule
Emp. Form.:
C30H31FN2O
Mol. Mass.:
454.5783
SMILES:
Fc1ccc(cc1)-n1cc(CCCCN2CCC3(CC2)OCc2ccccc32)c2ccccc12
: