Target
Phosphatidylinositol 3-kinase regulatory subunit alpha/4,5-bisphosphate 3-kinase catalytic subunit beta isoform
Ligand
BDBM236931
Substrate
Meas. Tech.
ChEMBL_1743027 (CHEMBL4158777)
IC50
2.3±n/a nM
Citation
 Erra, MTaltavull, JBernal, FJCaturla, JFCarrascal, MPagès, LMir, MEspinosa, SGràcia, JDomínguez, MSabaté, MParis, SMaldonado, MHernández, BBravo, MCalama, EMiralpeix, MLehner, MDCalbet, M Discovery of a Novel Inhaled PI3K? Inhibitor for the Treatment of Respiratory Diseases. J Med Chem 61:9551-9567 (2018)  
Target
Name:
Phosphatidylinositol 3-kinase regulatory subunit alpha/4,5-bisphosphate 3-kinase catalytic subunit beta isoform
Synonyms:
PI3-kinase subunit p110 beta/p85 alpha PI3K p110beta/p85alpha (Human) p110β/p85α | p110beta/p85alpha
Type:
Protein
Mol. Mass.:
Description:
Components:
This complex has 2 components.
Component 1
Name:
Phosphatidylinositol 4,5-bisphosphate 3-kinase catalytic subunit beta isoform
Synonyms:
PI3-kinase p110 subunit beta PI3Kbeta PIK3CB Phosphatidylinositol 4,5-bisphosphate 3-kinase catalytic subunit beta (PI3Kbeta) Phosphatidylinositol 4,5-bisphosphate 3-kinase catalytic subunit beta isoform (PI3K) Phosphatidylinositol 4,5-bisphosphate 3-kinase catalytic subunit beta isoform (PI3Kbeta) Phosphatidylinositol-4,5-bisphosphate 3-kinase catalytic subunit beta isoform Phosphoinositide 3-Kinase (PI3K), beta Chain A PtdIns-3-kinase p110
Type:
Enzyme Subunit
Mol. Mass.:
122769.00
Organism:
Homo sapiens (Human)
Description:
P42338
Residue:
1070
  
Component 2
Name:
Phosphatidylinositol 3-kinase regulatory subunit alpha
Synonyms:
GRB1 PI3-kinase class I PI3-kinase p85-alpha subunit PI3-kinase subunit p85-alpha PIK3CG/PIK3R1 Phosphatidylinositol 3-kinase 85 kDa regulatory subunit alpha (PI3K alpha) Phosphatidylinositol 3-kinase regulatory subunit alpha (PIK3R1) Phosphatidylinositol 3-kinase regulatory subunit alpha isoform 1 (PI3 Kinase alpha) Phosphatidylinositol 4,5-bisphosphate 3-kinase catalytic subunit alpha isoform (PI3Kalpha) PtdIns-3-kinase p85-alpha p85 alpha
Type:
Protein
Mol. Mass.:
83592.82
Organism:
Homo sapiens (Human)
Description:
P27986
Residue:
724
  
Inhibitor
Name:
BDBM236931
Synonyms:
US9388189, 27
Type:
Small organic molecule
Emp. Form.:
C27H22FN7O2
Mol. Mass.:
495.5077
SMILES:
C[C@H](Nc1ncnc2[nH]cc(-c3cc(O)cc(F)c3)c12)c1nn2ccc(C)c2c(=O)n1-c1ccccc1
: