Target
Transient receptor potential cation channel subfamily V member 1
Ligand
BDBM176564
Substrate
Meas. Tech.
ChEMBL_1744483 (CHEMBL4178993)
Ki
0.100000±n/a nM
Citation
 Lee, SKim, CAnn, JThorat, SAKim, EPark, JChoi, SBlumberg, PMFrank-Foltyn, RBahrenberg, GStockhausen, HChristoph, TLee, J Pyrazole C-region analogues of 2-(3-fluoro-4-methylsulfonylaminophenyl)propanamides as potent TRPV1 antagonists. Bioorg Med Chem Lett 27:4383-4388 (2017)  
Target
Name:
Transient receptor potential cation channel subfamily V member 1
Synonyms:
Capsaicin receptor TRPV1_RAT Trpv1 Vanilloid VR1 Vanilloid receptor 1 (VRI/TRPV1) Vanilloid receptor type 1-like (TrpV1/Vr1) Vr1l | osm-9-like TRP channel 1
Type:
Transient Receptor
Mol. Mass.:
94956.12
Organism:
Rattus norvegicus (rat)
Description:
O35433
Residue:
838
  
Inhibitor
Name:
BDBM176564
Synonyms:
US9120756, 26
Type:
Small organic molecule
Emp. Form.:
C21H19ClF4N4O3S
Mol. Mass.:
518.912
SMILES:
C[C@H](C(=O)NCc1cc(nn1-c1cccc(Cl)c1)C(F)(F)F)c1ccc(NS(C)(=O)=O)c(F)c1
: