Target
Adenosine deaminase
Ligand
BDBM28393
Substrate
Meas. Tech.
ChEMBL_1744716 (CHEMBL4179226)
Ki
2.2±n/a nM
Citation
 Kandalkar, SRRamaiah, PAJoshi, MWavhal, AWaman, YRaje, AATambe, AAnsari, SDe, SPalle, VPMookhtiar, KADeshpande, AMBarawkar, DA Modifications of flexible nonyl chain and nucleobase head group of (+)-erythro-9-(2's-hydroxy-3's-nonyl)adenine [(+)-EHNA] as adenosine deaminase inhibitors. Bioorg Med Chem 25:5799-5819 (2017)  
Target
Name:
Adenosine deaminase
Synonyms:
ADA Adenosine aminohydrolase
Type:
Enzyme
Mol. Mass.:
40910.44
Organism:
Bos taurus (bovine)
Description:
Residue:
363
  
Inhibitor
Name:
BDBM28393
Synonyms:
(+)-EHNA CHEMBL296435
Type:
Small organic molecule
Emp. Form.:
C14H23N5O
Mol. Mass.:
277.3653
SMILES:
CCCCCC[C@H]([C@H](C)O)n1cnc2c(N)ncnc12
: