Target
Tyrosine-protein kinase ABL1
Ligand
BDBM50383274
Substrate
Meas. Tech.
ChEMBL_1744967 (CHEMBL4179477)
IC50
9690±n/a nM
Citation
 Romu, AALei, ZZhou, BChen, ZSKorlipara, V Design, synthesis and biological evaluation of WZ4002 analogues as EGFR inhibitors. Bioorg Med Chem Lett 27:4832-4837 (2017)  
Target
Name:
Tyrosine-protein kinase ABL1
Synonyms:
ABL1_MOUSE Abelson tyrosine-protein kinase 1 Abl1 p150
Type:
PROTEIN
Mol. Mass.:
122698.35
Organism:
Mus musculus
Description:
ChEMBL_767349
Residue:
1123
  
Inhibitor
Name:
BDBM50383274
Synonyms:
CHEMBL1229592 US9670213, WZ4002
Type:
Small organic molecule
Emp. Form.:
C25H27ClN6O3
Mol. Mass.:
494.973
SMILES:
COc1cc(ccc1Nc1ncc(Cl)c(Oc2cccc(NC(=O)C=C)c2)n1)N1CCN(C)CC1
: