Target
Cyclin-dependent kinase 4
Ligand
BDBM50110183
Substrate
Meas. Tech.
ChEMBL_1746079 (CHEMBL4180589)
IC50
1.9±n/a nM
Citation
 Fu, YTang, SSu, YLan, XYe, YZha, CLi, LCao, JChen, YJiang, LHuang, YDing, JGeng, MHuang, MWan, H Discovery of a class of diheteroaromatic amines as orally bioavailable CDK1/4/6 inhibitors. Bioorg Med Chem Lett 27:5332-5336 (2017)  
Target
Name:
Cyclin-dependent kinase 4
Synonyms:
CDK4 Cell division protein kinase 4 PSK-J3
Type:
Enzyme Subunit
Mol. Mass.:
33731.96
Organism:
Homo sapiens (Human)
Description:
P11802
Residue:
303
  
Inhibitor
Name:
BDBM50110183
Synonyms:
Abemaciclib US10626107, Example LY2835219 US10696678, Example LY2835219 US11053238, LY2835219 US11351170, Example Abemaciclib
Type:
Small organic molecule
Emp. Form.:
C27H32F2N8
Mol. Mass.:
506.5934
SMILES:
CCN1CCN(Cc2ccc(Nc3ncc(F)c(n3)-c3cc(F)c4nc(C)n(C(C)C)c4c3)nc2)CC1
: