Target
Kappa-type opioid receptor
Ligand
BDBM50019487
Substrate
Meas. Tech.
ChEBML_146074
Ki
24±n/a nM
Citation
 Gairin, JEMazarguil, HAlvinerie, PSaint-Pierre, SMeunier, JCCros, J Synthesis and biological activities of dynorphin A analogues with opioid antagonist properties. J Med Chem 29:1913-7 (1986)  
Target
Name:
Kappa-type opioid receptor
Synonyms:
Kappa Opioid Receptor OPRK1 Opiate Kappa 1 | mu/kappa opioid receptor
Type:
G Protein-Coupled Receptor (GPCR)
Mol. Mass.:
42744.99
Organism:
Cavia porcellus (domestic guinea pig)
Description:
P41144
Residue:
380
  
Inhibitor
Name:
BDBM50019487
Synonyms:
CHEMBL2373013 | NH2-Tyr-D-Trp-Gly-D-Trp-Leu-Arg-Arg-D-Trp-Arg-D-Pro-Lys-OH
Type:
Small organic molecule
Emp. Form.:
C79H110N24O13
Mol. Mass.:
1603.8717
SMILES:
CC(C)C[C@H](NC(=O)[C@@H](Cc1c[nH]c2ccccc12)NC(=O)CNC(=O)[C@@H](Cc1c[nH]c2ccccc12)NC(=O)[C@@H](N)Cc1ccc(O)cc1)C(=O)N[C@@H](CCCN=C(N)N)C(=O)N[C@@H](CCCN=C(N)N)C(=O)N[C@H](Cc1c[nH]c2ccccc12)C(=O)N[C@@H](CCCN=C(N)N)C(=O)N1CCC[C@@H]1C(=O)N[C@@H](CCCCN)C(O)=O
: