Target
Amine oxidase [flavin-containing] B
Ligand
BDBM50453020
Substrate
Meas. Tech.
ChEMBL_1748951 (CHEMBL4183461)
Ki
0.310000±n/a nM
Citation
 Reis, JManzella, NCagide, FMialet-Perez, JUriarte, EParini, ABorges, FBinda, C Tight-Binding Inhibition of Human Monoamine Oxidase B by Chromone Analogs: A Kinetic, Crystallographic, and Biological Analysis. J Med Chem 61:4203-4212 (2018)  
Target
Name:
Amine oxidase [flavin-containing] B
Synonyms:
AOFB_HUMAN MAOB Monoamine oxidase type B (MAO B) Monoamine oxidase type B (MAOB)
Type:
Protein
Mol. Mass.:
58768.76
Organism:
Homo sapiens (Human)
Description:
P27338
Residue:
520
  
Inhibitor
Name:
BDBM50453020
Synonyms:
CHEMBL4209203
Type:
Small organic molecule
Emp. Form.:
C18H15NO3
Mol. Mass.:
293.3166
SMILES:
Cc1ccc(NC(=O)c2coc3ccccc3c2=O)cc1C
: