Target
D(2) dopamine receptor
Ligand
BDBM50020177
Substrate
Meas. Tech.
ChEBML_63037
Ki
0.680000±n/a nM
Citation
 van Wijngaarden, IKruse, CGvan der Heyden, JATulp, MT 2-Phenylpyrroles as conformationally restricted benzamide analogues. A new class of potential antipsychotics. 2. J Med Chem 31:1934-40 (1988)  
Target
Name:
D(2) dopamine receptor
Synonyms:
DOPAMINE D2 DOPAMINE D2 Short Dopamine D2 receptor Drd2
Type:
G Protein-Coupled Receptor (GPCR)
Mol. Mass.:
50931.60
Organism:
Rattus norvegicus (rat)
Description:
P61169
Residue:
444
  
Inhibitor
Name:
BDBM50020177
Synonyms:
1-(3,4-Dihydro-2H-benzo[b][1,4]dioxepin-6-yl)-4-(5-phenyl-1H-pyrrol-2-ylmethyl)-piperazine | CHEMBL61294
Type:
Small organic molecule
Emp. Form.:
C24H27N3O2
Mol. Mass.:
389.4901
SMILES:
C(N1CCN(CC1)c1cccc2OCCCOc12)c1ccc([nH]1)-c1ccccc1
: