Target
DNA-(apurinic or apyrimidinic site) endonuclease
Ligand
BDBM50453740
Substrate
Meas. Tech.
ChEMBL_1750384 (CHEMBL4185144)
IC50
200±n/a nM
Citation
 Laev, SSSalakhutdinov, NFLavrik, OI Inhibitors of nuclease and redox activity of apurinic/apyrimidinic endonuclease 1/redox effector factor 1 (APE1/Ref-1). Bioorg Med Chem 25:2531-2544 (2017)  
Target
Name:
DNA-(apurinic or apyrimidinic site) endonuclease
Synonyms:
APE APEX APEX1_HUMAN Apurinic-apyrimidinic endonuclease 1 (APE-1) DNA-(apurinic or apyrimidinic site) lyase REF1
Type:
Protein
Mol. Mass.:
35560.12
Organism:
Homo sapiens (Human)
Description:
P27695
Residue:
318
  
Inhibitor
Name:
BDBM50453740
Synonyms:
CHEMBL4217125
Type:
Small organic molecule
Emp. Form.:
C12H4Br6
Mol. Mass.:
627.584
SMILES:
Brc1cc(cc(Br)c1Br)-c1cc(Br)c(Br)c(Br)c1
: