Target
DNA-(apurinic or apyrimidinic site) endonuclease
Ligand
BDBM60996
Substrate
Meas. Tech.
ChEMBL_1750393 (CHEMBL4185153)
IC50
55±n/a nM
Citation
 Laev, SSSalakhutdinov, NFLavrik, OI Inhibitors of nuclease and redox activity of apurinic/apyrimidinic endonuclease 1/redox effector factor 1 (APE1/Ref-1). Bioorg Med Chem 25:2531-2544 (2017)  
Target
Name:
DNA-(apurinic or apyrimidinic site) endonuclease
Synonyms:
APE APEX APEX1_HUMAN Apurinic-apyrimidinic endonuclease 1 (APE-1) DNA-(apurinic or apyrimidinic site) lyase REF1
Type:
Protein
Mol. Mass.:
35560.12
Organism:
Homo sapiens (Human)
Description:
P27695
Residue:
318
  
Inhibitor
Name:
BDBM60996
Synonyms:
5-[(3-carboxy-4-hydroxy-phenyl)-(3-carboxy-4-keto-cyclohexa-2,5-dien-1-ylidene)methyl]-2-hydroxy-benzoic acid 5-[(3-carboxy-4-hydroxyphenyl)-(3-carboxy-4-oxocyclohexa-2,5-dien-1-ylidene)methyl]-2-hydroxybenzoic acid Aurintricarboxylic acid SMR000326731 | cid_2259
Type:
Small organic molecule
Emp. Form.:
C22H14O9
Mol. Mass.:
422.3412
SMILES:
[#8]-[#6](=O)-[#6]-1=[#6]\[#6](-[#6]=[#6]-[#6]-1=O)=[#6](\c1ccc(-[#8])c(c1)-[#6](-[#8])=O)-c1ccc(-[#8])c(c1)-[#6](-[#8])=O
: