Target
Vasopressin V2 receptor
Ligand
BDBM50020656
Substrate
Meas. Tech.
ChEBML_215034
Ki
9.40±n/a nM
Citation
 Huffman, WFAli, FEBryan, WMCallahan, JFMoore, MLSilvestri, JSYim, NCKinter, LBMcDonald, JEAshton-Shue, D Novel vasopressin analogues that help define a minimum effective antagonist pharmacophore. J Med Chem 28:1759-60 (1986)  
Target
Name:
Vasopressin V2 receptor
Synonyms:
AVPR2 | V2R_PIG
Type:
PROTEIN
Mol. Mass.:
40556.17
Organism:
Sus scrofa
Description:
ChEMBL_214870
Residue:
370
  
Inhibitor
Name:
BDBM50020656
Synonyms:
1-[19-Benzyl-13-carbamoylmethyl-22-(4-ethoxy-benzyl)-16-isopropyl-12,15,18,21,24-pentaoxo-7,8-dithia-11,14,17,20,23-pentaaza-spiro[5.19]pentacosane-10-carbonyl]-pyrrolidine-2-carboxylic acid (5-amino-1-carbamoyl-pentyl)-amide | CHEMBL262499
Type:
Small organic molecule
Emp. Form.:
C51H74N10O10S2
Mol. Mass.:
1051.324
SMILES:
CCOc1ccc(C[C@H]2NC(=O)CC3(CCCCC3)SSC[C@@H](NC(=O)[C@@H](CC(N)=O)NC(=O)[C@@H](NC(=O)[C@@H](Cc3ccccc3)NC2=O)C(C)C)C(=O)N2CCC[C@H]2C(=O)N[C@H](CCCCN)C(N)=O)cc1
: