Target
Vasopressin V2 receptor
Ligand
BDBM50016760
Substrate
Meas. Tech.
ChEMBL_215034 (CHEMBL820884)
Ki
26±n/a nM
Citation
 Huffman, WFAli, FEBryan, WMCallahan, JFMoore, MLSilvestri, JSYim, NCKinter, LBMcDonald, JEAshton-Shue, D Novel vasopressin analogues that help define a minimum effective antagonist pharmacophore. J Med Chem 28:1759-60 (1986)  
Target
Name:
Vasopressin V2 receptor
Synonyms:
AVPR2 | V2R_PIG
Type:
PROTEIN
Mol. Mass.:
40556.17
Organism:
Sus scrofa
Description:
ChEMBL_214870
Residue:
370
  
Inhibitor
Name:
BDBM50016760
Synonyms:
19-Benzyl-13-carbamoylmethyl-22-(4-ethoxy-benzyl)-16-isopropyl-12,15,18,21,24-pentaoxo-7,8-dithia-11,14,17,20,23-pentaaza-spiro[5.19]pentacosane-10-carboxylic acid (5-amino-1-carbamoyl-pentyl)-amide N*1*-[1-(5-Amino-1-carbamoyl-pentylcarbamoyl)-2-mercapto-ethyl]-2-[2-(2-{3-(4-ethoxy-phenyl)-2-[2-(1-mercapto-cyclohexyl)-acetylamino]-propionylamino}-3-phenyl-propionylamino)-3-methyl-butyrylamino]-succinamide
Type:
Small organic molecule
Emp. Form.:
C46H67N9O9S2
Mol. Mass.:
954.209
SMILES:
CCOc1ccc(C[C@H]2NC(=O)CC3(CCCCC3)SSC[C@@H](NC(=O)[C@@H](CC(N)=O)NC(=O)[C@@H](NC(=O)[C@@H](Cc3ccccc3)NC2=O)C(C)C)C(=O)N[C@H](CCCCN)C(N)=O)cc1
: