Target
Bifunctional epoxide hydrolase 2
Ligand
BDBM50454599
Substrate
Meas. Tech.
ChEMBL_1752883 (CHEMBL4187643)
IC50
0.400000±n/a nM
Citation
 Kodani, SDBhakta, SHwang, SHPakhomova, SNewcomer, MEMorisseau, CHammock, BD Identification and optimization of soluble epoxide hydrolase inhibitors with dual potency towards fatty acid amide hydrolase. Bioorg Med Chem Lett 28:762-768 (2018)  
Target
Name:
Bifunctional epoxide hydrolase 2
Synonyms:
Eph2 Epoxide hydratase Soluble epoxide hydrolase (sEH)
Type:
Enzyme
Mol. Mass.:
62512.06
Organism:
Mus musculus (Mouse)
Description:
P34914
Residue:
554
  
Inhibitor
Name:
BDBM50454599
Synonyms:
CHEMBL4216368
Type:
Small organic molecule
Emp. Form.:
C20H21F3N2O4
Mol. Mass.:
410.3869
SMILES:
Oc1ccc(O[C@H]2CC[C@@H](CC2)NC(=O)Nc2ccc(OC(F)(F)F)cc2)cc1
: