Target
TGF-beta receptor type-1
Ligand
BDBM21509
Substrate
Meas. Tech.
ChEMBL_1753657 (CHEMBL4188417)
IC50
370±n/a nM
Citation
 Harikrishnan, LSWarrier, JTebben, AJTonukunuru, GMadduri, SRBaligar, VMannoori, RSeshadri, BRahaman, HArunachalam, PNDikundwar, AGFink, BEFargnoli, JFereshteh, MFan, YLippy, JHo, CPWautlet, BSheriff, SRuzanov, MBorzilleri, RM Heterobicyclic inhibitors of transforming growth factor beta receptor I (TGF?RI). Bioorg Med Chem 26:1026-1034 (2018)  
Target
Name:
TGF-beta receptor type-1
Synonyms:
ALK-5 Activin A receptor type II-like protein kinase of 53kD SKR4 TGF-beta receptor type I TGFBR1 TGFR1_HUMAN Transforming growth factor-beta receptor type I
Type:
enzyme
Mol. Mass.:
55968.24
Organism:
Homo sapiens (Human)
Description:
P36897
Residue:
503
  
Inhibitor
Name:
BDBM21509
Synonyms:
4-[2-({4-[2-(pyridin-2-yl)-4H,5H,6H-pyrrolo[1,2-a]pyrazol-3-yl]quinolin-7-yl}oxy)ethyl]morpholine | Dihydropyrrolopyrazole, 15d
Type:
Small organic molecule
Emp. Form.:
C26H27N5O2
Mol. Mass.:
441.5249
SMILES:
C(CN1CCOCC1)Oc1ccc2c(ccnc2c1)-c1c2CCCn2nc1-c1ccccn1
: