Target
Cyclin-dependent kinase 4
Ligand
BDBM50455068
Substrate
Meas. Tech.
ChEMBL_1753761 (CHEMBL4188521)
IC50
1.000000±n/a nM
Citation
 Wang, YLiu, WJYin, LLi, HChen, ZHZhu, DXSong, XQCheng, ZZSong, PWang, ZLi, ZG Design and synthesis of 4-(2,3-dihydro-1H-benzo[d]pyrrolo[1,2-a]imidazol-7-yl)-N-(5-(piperazin-1-ylmethyl)pyridine-2-yl)pyrimidin-2-amine as a highly potent and selective cyclin-dependent kinases 4 and 6 inhibitors and the discovery of structure-activity relationships. Bioorg Med Chem Lett 28:974-978 (2018)  
Target
Name:
Cyclin-dependent kinase 4
Synonyms:
CDK4 Cell division protein kinase 4 PSK-J3
Type:
Enzyme Subunit
Mol. Mass.:
33731.96
Organism:
Homo sapiens (Human)
Description:
P11802
Residue:
303
  
Inhibitor
Name:
BDBM50455068
Synonyms:
CHEMBL4205645 | US10696678, Example 22
Type:
Small organic molecule
Emp. Form.:
C28H33FN8
Mol. Mass.:
500.6136
SMILES:
CCN1CCN(Cc2ccc(Nc3nccc(n3)-c3cc(F)c4nc5CCC(C)(C)n5c4c3)nc2)CC1
: