Target
RAC-alpha serine/threonine-protein kinase
Ligand
BDBM50172079
Substrate
Meas. Tech.
ChEMBL_1754210 (CHEMBL4188970)
IC50
>10000±n/a nM
Citation
 Myers, SHTemps, CHouston, DRBrunton, VGUnciti-Broceta, A Development of Potent Inhibitors of Receptor Tyrosine Kinases by Ligand-Based Drug Design and Target-Biased Phenotypic Screening. J Med Chem 61:2104-2110 (2018)  
Target
Name:
RAC-alpha serine/threonine-protein kinase
Synonyms:
AKT phosphorylation (p-AKT) AKT1/PPP1CA C-AKT PKB alpha Protein kinase B Protein kinase B (Akt 1) Protein kinase B alpha Proto-oncogene Akt (Akt1) Proto-oncogene c-Akt (AKT1) RAC-PK-alpha RAC-alpha serine/threonine-protein kinase (AKT1) | RAC-alpha serine/threonine-protein kinase (pAKT)
Type:
Enzyme
Mol. Mass.:
55681.25
Organism:
Homo sapiens (Human)
Description:
P31749
Residue:
480
  
Inhibitor
Name:
BDBM50172079
Synonyms:
CHEMBL3809489
Type:
Small organic molecule
Emp. Form.:
C30H34N8
Mol. Mass.:
506.6446
SMILES:
Nc1nc(Nc2ccc3CC[C@@H](CCc3c2)N2CCCC2)nn1-c1cc2CCCc3ccccc3-c2nn1
: