Target
Proto-oncogene tyrosine-protein kinase receptor Ret
Ligand
BDBM50172079
Substrate
Meas. Tech.
ChEMBL_1754220 (CHEMBL4188980)
IC50
3.0±n/a nM
Citation
 Myers, SHTemps, CHouston, DRBrunton, VGUnciti-Broceta, A Development of Potent Inhibitors of Receptor Tyrosine Kinases by Ligand-Based Drug Design and Target-Biased Phenotypic Screening. J Med Chem 61:2104-2110 (2018)  
Target
Name:
Proto-oncogene tyrosine-protein kinase receptor Ret
Synonyms:
CDHF12 Cadherin family member 12 Proto-oncogene c-Ret RET51 Tyrosine-protein kinase Ret (RET)
Type:
Protein
Mol. Mass.:
124318.29
Organism:
Homo sapiens (Human)
Description:
P07949
Residue:
1114
  
Inhibitor
Name:
BDBM50172079
Synonyms:
CHEMBL3809489
Type:
Small organic molecule
Emp. Form.:
C30H34N8
Mol. Mass.:
506.6446
SMILES:
Nc1nc(Nc2ccc3CC[C@@H](CCc3c2)N2CCCC2)nn1-c1cc2CCCc3ccccc3-c2nn1
: