Target
Platelet-derived growth factor receptor alpha
Ligand
BDBM50172079
Substrate
Meas. Tech.
ChEMBL_1754228 (CHEMBL4188988)
IC50
20±n/a nM
Citation
 Myers, SHTemps, CHouston, DRBrunton, VGUnciti-Broceta, A Development of Potent Inhibitors of Receptor Tyrosine Kinases by Ligand-Based Drug Design and Target-Biased Phenotypic Screening. J Med Chem 61:2104-2110 (2018)  
Target
Name:
Platelet-derived growth factor receptor alpha
Synonyms:
Alpha-type platelet-derived growth factor receptor PDGFRA PGFRA_HUMAN Platelet-derived growth factor receptor alpha (PDGFRA) RHEPDGFRA
Type:
Protein
Mol. Mass.:
122633.38
Organism:
Homo sapiens (Human)
Description:
P16234
Residue:
1089
  
Inhibitor
Name:
BDBM50172079
Synonyms:
CHEMBL3809489
Type:
Small organic molecule
Emp. Form.:
C30H34N8
Mol. Mass.:
506.6446
SMILES:
Nc1nc(Nc2ccc3CC[C@@H](CCc3c2)N2CCCC2)nn1-c1cc2CCCc3ccccc3-c2nn1
: