Target
Protease
Ligand
BDBM13934
Substrate
Meas. Tech.
ChEMBL_1754837 (CHEMBL4189597)
EC50
0.700000±n/a nM
Citation
 Subbaiah, MAMMeanwell, NAKadow, JFSubramani, LAnnadurai, MRamar, TDesai, SDSinha, SSubramanian, MMandlekar, SSridhar, SPadmanabhan, SBhutani, PArla, RJenkins, SMKrystal, MRWang, CSarabu, R Coupling of an Acyl Migration Prodrug Strategy with Bio-activation To Improve Oral Delivery of the HIV-1 Protease Inhibitor Atazanavir. J Med Chem 61:4176-4188 (2018)  
Target
Name:
Protease
Synonyms:
Type:
Enzyme
Mol. Mass.:
10904.79
Organism:
Human immunodeficiency virus 1 (HIV-1)
Description:
Q9YQ12
Residue:
99
  
Inhibitor
Name:
BDBM13934
Synonyms:
Atazanavir CGP 73547 Latazanavir methyl N-[(1S)-1-[[(2S,3S)-3-hydroxy-4-[[[(2S)-2-(methoxycarbonylamino)-3,3-dimethyl-butanoyl]amino]-[(4-pyridin-2-ylphenyl)methyl]amino]-1-phenyl-butan-2-yl]carbamoyl]-2,2-dimethyl-propyl]carbamate | methyl N-[(1S)-1-{[(2S,3S)-3-hydroxy-4-[(2S)-2-[(methoxycarbonyl)amino]-3,3-dimethyl-N'-{[4-(pyridin-2-yl)phenyl]methyl}butanehydrazido]-1-phenylbutan-2-yl]carbamoyl}-2,2-dimethylpropyl]carbamate
Type:
Small organic molecule
Emp. Form.:
C38H52N6O7
Mol. Mass.:
704.8555
SMILES:
COC(=O)N[C@H](C(=O)N[C@@H](Cc1ccccc1)[C@@H](O)CN(Cc1ccc(cc1)-c1ccccn1)NC(=O)[C@@H](NC(=O)OC)C(C)(C)C)C(C)(C)C
: