Target
Adenosine receptor A1
Ligand
BDBM50021083
Substrate
Meas. Tech.
ChEBML_29319
Ki
24±n/a nM
Citation
 Jacobson, KAKirk, KLPadgett, WLDaly, JW Functionalized congeners of 1,3-dialkylxanthines: preparation of analogues with high affinity for adenosine receptors. J Med Chem 28:1334-40 (1985)  
Target
Name:
Adenosine receptor A1
Synonyms:
AA1R_RAT ADENOSINE A1 high Adenosine A1 receptor (A1) Adenosine receptors A1 | Adora1
Type:
Protein
Mol. Mass.:
36704.13
Organism:
Rattus norvegicus (rat)
Description:
Residue:
326
  
Inhibitor
Name:
BDBM50021083
Synonyms:
CHEMBL265739 | N-(2-Acetylamino-ethyl)-2-[4-(2,6-dioxo-1,3-dipropyl-2,3,6,9-tetrahydro-1H-purin-8-yl)-phenoxy]-acetamide
Type:
Small organic molecule
Emp. Form.:
C23H30N6O5
Mol. Mass.:
470.5215
SMILES:
CCCn1c2[nH]c(nc2c(=O)n(CCC)c1=O)-c1ccc(OCC(=O)NCCNC(C)=O)cc1
: