Target
Alpha-2A adrenergic receptor [16-465]/Alpha-2B adrenergic receptor/Alpha-2C adrenergic receptor
Ligand
BDBM50021196
Substrate
Meas. Tech.
ChEMBL_34499 (CHEMBL649627)
Ki
1.6±n/a nM
Citation
 Huff, JRAnderson, PSBaldwin, JJClineschmidt, BVGuare, JPLotti, VJPettibone, DJRandall, WCVacca, JP N-(1,3,4,6,7,12b-hexahydro-2H-benzo[b]furo[2,3-a]quinolizin -2-yl)-N- methyl-2-hydroxyethane-sulfonamide: a potent and selective alpha 2-adrenoceptor antagonist. J Med Chem 28:1756-9 (1986)  
Target
Name:
Alpha-2A adrenergic receptor [16-465]/Alpha-2B adrenergic receptor/Alpha-2C adrenergic receptor
Synonyms:
Adrenergic receptor alpha-2
Type:
Mol. Mass.:
Description:
ASSAY_ID of ChEMBL is 935397
Components:
This complex has 3 components.
Component 1
Name:
Alpha-2C adrenergic receptor
Synonyms:
ADA2C_RAT Adrenergic receptor alpha adrenergic Alpha2 | adrenergic Alpha2C
Type:
Enzyme Catalytic Domain
Mol. Mass.:
49890.50
Organism:
RAT
Description:
adrenergic Alpha2 0 RAT::P22086
Residue:
458
  
Component 2
Name:
Alpha-2B adrenergic receptor
Synonyms:
ADA2B_RAT Adrenergic receptor alpha Alpha-2B adrenergic receptor Alpha-2B adrenoreceptor | adrenergic Alpha2B
Type:
Enzyme Catalytic Domain
Mol. Mass.:
50379.83
Organism:
NEONATAL RAT
Description:
adrenergic Alpha2B ADRA2B NEONATAL RAT::P19328
Residue:
453
  
Component 3
Name:
Alpha-2A adrenergic receptor [16-465]
Synonyms:
ADA2A_RAT Adrenaline 2 Alpha-2A adrenoceptor Alpha-2AAR Alpha2 Adrenoreceptor adrenergic Alpha2A
Type:
G-protein coupled receptor
Mol. Mass.:
48961.69
Organism:
Rattus norvegicus (rat)
Description:
P22909[16-465]
Residue:
450
  
Inhibitor
Name:
BDBM50021196
Synonyms:
2-Hydroxy-ethanesulfonic acid (1,3,4,5,6,11b-hexahydro-2H-11-oxa-4a-aza-benzo[a]fluoren-2-yl)-methyl-amide | CHEMBL48558
Type:
Small organic molecule
Emp. Form.:
C18H24N2O4S
Mol. Mass.:
364.459
SMILES:
CN(C1CCN2CCc3c(oc4ccccc34)C2C1)S(=O)(=O)CCO
: