Target
Alpha-1A adrenergic receptor
Ligand
BDBM50021195
Substrate
Meas. Tech.
ChEBML_33099
Ki
110±n/a nM
Citation
 Huff, JRAnderson, PSBaldwin, JJClineschmidt, BVGuare, JPLotti, VJPettibone, DJRandall, WCVacca, JP N-(1,3,4,6,7,12b-hexahydro-2H-benzo[b]furo[2,3-a]quinolizin -2-yl)-N- methyl-2-hydroxyethane-sulfonamide: a potent and selective alpha 2-adrenoceptor antagonist. J Med Chem 28:1756-9 (1986)  
Target
Name:
Alpha-1A adrenergic receptor
Synonyms:
ADA1A_BOVIN ADRA1C Alpha 1A-adrenoreceptor Cerebral cortex alpha adrenergic receptor | adrenergic Alpha1
Type:
Enzyme Catalytic Domain
Mol. Mass.:
51492.08
Organism:
CALF
Description:
adrenergic Alpha1 0 CALF
Residue:
466
  
Inhibitor
Name:
BDBM50021195
Synonyms:
2-Hydroxy-ethanesulfonic acid (1,3,4,5,6,11b-hexahydro-2H-11-oxa-4a-aza-benzo[a]fluoren-2-yl)-methyl-amide | CHEMBL48603
Type:
Small organic molecule
Emp. Form.:
C18H24N2O4S
Mol. Mass.:
364.459
SMILES:
CN([C@@H]1CCN2CCc3c(oc4ccccc34)[C@@H]2C1)S(=O)(=O)CCO
: