Target
Amine oxidase [flavin-containing] B
Ligand
BDBM50456659
Substrate
Meas. Tech.
ChEMBL_1757753 (CHEMBL4192761)
IC50
7014±n/a nM
Citation
 Yang, HLCai, PLiu, QHYang, XLLi, FWang, JWu, JJWang, XBKong, LY Design, synthesis and evaluation of coumarin-pargyline hybrids as novel dual inhibitors of monoamine oxidases and amyloid-? aggregation for the treatment of Alzheimer's disease. Eur J Med Chem 138:715-728 (2017)  
Target
Name:
Amine oxidase [flavin-containing] B
Synonyms:
AOFB_HUMAN MAOB Monoamine oxidase type B (MAO B) Monoamine oxidase type B (MAOB)
Type:
Protein
Mol. Mass.:
58768.76
Organism:
Homo sapiens (Human)
Description:
P27338
Residue:
520
  
Inhibitor
Name:
BDBM50456659
Synonyms:
CHEMBL4217683
Type:
Small organic molecule
Emp. Form.:
C22H21NO4
Mol. Mass.:
363.4064
SMILES:
COc1cccc(CN(CCOc2ccc3ccc(=O)oc3c2)CC#C)c1
: