Target
Cholinesterase
Ligand
BDBM50456709
Substrate
Meas. Tech.
ChEMBL_1757790 (CHEMBL4192798)
Ki
29±n/a nM
Citation
 Roldán-Peña, JMAlejandre-Ramos, DLópez, ÓMaya, ILagunes, IPadrón, JMPeña-Altamira, LEBartolini, MMonti, BBolognesi, MLFernández-Bolaños, JG New tacrine dimers with antioxidant linkers as dual drugs: Anti-Alzheimer's and antiproliferative agents. Eur J Med Chem 138:761-773 (2017)  
Target
Name:
Cholinesterase
Synonyms:
BCHE CHLE_HORSE | Cholinesterase
Type:
Enzyme
Mol. Mass.:
65643.35
Organism:
Equus caballus (Horse)
Description:
P81908
Residue:
574
  
Inhibitor
Name:
BDBM50456709
Synonyms:
CHEMBL4205454
Type:
Small organic molecule
Emp. Form.:
C27H34N4OSe
Mol. Mass.:
509.55
SMILES:
[#6]-[#8]-c1ccc(-[#7]-[#6](=[Se;v2])-[#7]-[#6]-[#6]-[#6]-[#6]-[#6]-[#6]-[#7]-c2c3-[#6]-[#6]-[#6]-[#6]-c3nc3ccccc23)cc1
: