Target
Cholinesterase
Ligand
BDBM50456825
Substrate
Meas. Tech.
ChEMBL_1758287 (CHEMBL4193295)
IC50
1.6±n/a nM
Citation
 Lan, JSDing, YLiu, YKang, PHou, JWZhang, XYXie, SSZhang, T Design, synthesis and biological evaluation of novel coumarin-N-benzyl pyridinium hybrids as multi-target agents for the treatment of Alzheimer's disease. Eur J Med Chem 139:48-59 (2017)  
Target
Name:
Cholinesterase
Synonyms:
BCHE CHLE_HORSE | Cholinesterase
Type:
Enzyme
Mol. Mass.:
65643.35
Organism:
Equus caballus (Horse)
Description:
P81908
Residue:
574
  
Inhibitor
Name:
BDBM50456825
Synonyms:
CHEMBL4210401
Type:
Small organic molecule
Emp. Form.:
C24H22BrNO3
Mol. Mass.:
452.34
SMILES:
[Br-].Cc1ccccc1C[n+]1ccc(COc2ccc3c(C)cc(=O)oc3c2)cc1
: