Target
Proton-coupled folate transporter
Ligand
BDBM50027656
Substrate
Meas. Tech.
ChEMBL_1759636 (CHEMBL4194644)
Ki
259±n/a nM
Citation
 Ravindra, MWallace-Povirk, AKarim, MAWilson, MRO'Connor, CWhite, KKushner, JPolin, LGeorge, CHou, ZMatherly, LHGangjee, A Tumor Targeting with Novel Pyridyl 6-Substituted Pyrrolo[2,3- d]Pyrimidine Antifolates via Cellular Uptake by Folate Receptor ? and the Proton-Coupled Folate Transporter and Inhibition of De Novo Purine Nucleotide Biosynthesis. J Med Chem 61:2027-2040 (2018)  
Target
Name:
Proton-coupled folate transporter
Synonyms:
G21 Heme carrier protein 1 PCFT/HCP1 SLC46A1 | Solute carrier family 46 member 1
Type:
PROTEIN
Mol. Mass.:
49782.13
Organism:
Homo sapiens (Human)
Description:
ChEMBL_1469597
Residue:
459
  
Inhibitor
Name:
BDBM50027656
Synonyms:
CHEBI:63616 LY-231514 US9422297, Pemetrexed
Type:
Small organic molecule
Emp. Form.:
C20H21N5O6
Mol. Mass.:
427.4106
SMILES:
Nc1nc2[nH]cc(CCc3ccc(cc3)C(=O)N[C@@H](CCC(O)=O)C(O)=O)c2c(=O)[nH]1
: