Target
Thymidylate synthase
Ligand
BDBM50021746
Substrate
Meas. Tech.
ChEBML_209133
Ki
1400±n/a nM
Citation
 Al-Razzak, LASchwepler, DDecedue, CJBalzarini, JDe Clercq, EMertes, MP 5-Quinone derivatives of 2'-deoxyuridine 5'-phosphate: inhibition and inactivation of thymidylate synthase, antitumor cell, and antiviral studies. J Med Chem 30:409-19 (1987)  
Target
Name:
Thymidylate synthase
Synonyms:
TSase Thymidylate Synthase (TS) thyA
Type:
Enzyme
Mol. Mass.:
36576.54
Organism:
Lactobacillus casei
Description:
Residue:
316
  
Inhibitor
Name:
BDBM50021746
Synonyms:
CHEMBL3143107 | Phosphoric acid mono-{5-[5-(2,5-dimethoxy-3,4,6-trimethyl-phenyl)-2,4-dioxo-3,4-dihydro-2H-pyrimidin-1-yl]-3-hydroxy-tetrahydro-furan-2-ylmethyl} ester
Type:
Small organic molecule
Emp. Form.:
C20H27N2O10P
Mol. Mass.:
486.4095
SMILES:
COc1c(C)c(C)c(OC)c(c1C)-c1cn([C@H]2C[C@H](O)[C@@H](COP(O)(O)=O)O2)c(=O)[nH]c1=O
: