Target
Prothrombin
Ligand
BDBM50457929
Substrate
Meas. Tech.
ChEMBL_1761070 (CHEMBL4196317)
Ki
<0.010000±n/a nM
Citation
 Xie, ZTian, YLv, XXiao, XZhan, MCheng, KLi, SLiao, C The selectivity and bioavailability improvement of novel oral anticoagulants: An overview. Eur J Med Chem 146:299-317 (2018)  
Target
Name:
Prothrombin
Synonyms:
Activation peptide fragment 1 Coagulation factor II Prothrombin precursor Thrombin heavy chain | Thrombin light chain
Type:
Protein
Mol. Mass.:
70029.57
Organism:
Homo sapiens (Human)
Description:
P00734
Residue:
622
  
Inhibitor
Name:
BDBM50457929
Synonyms:
CHEMBL104951
Type:
Small organic molecule
Emp. Form.:
C22H18Cl2F2N8O2
Mol. Mass.:
535.334
SMILES:
FC(F)(CNc1ncc(Cl)n(CC(=O)NCc2cc(Cl)ccc2-n2cncn2)c1=O)c1ccccn1
: