Target
Cholinesterase
Ligand
BDBM50458104
Substrate
Meas. Tech.
ChEMBL_1761985 (CHEMBL4197232)
IC50
1.3±n/a nM
Citation
 Li, GHong, GLi, XZhang, YXu, ZMao, LFeng, XLiu, T Synthesis and activity towards Alzheimer's disease in vitro: Tacrine, phenolic acid and ligustrazine hybrids. Eur J Med Chem 148:238-254 (2018)  
Target
Name:
Cholinesterase
Synonyms:
BCHE CHLE_HORSE | Cholinesterase
Type:
Enzyme
Mol. Mass.:
65643.35
Organism:
Equus caballus (Horse)
Description:
P81908
Residue:
574
  
Inhibitor
Name:
BDBM50458104
Synonyms:
CHEMBL4212711
Type:
Small organic molecule
Emp. Form.:
C44H55N7O4
Mol. Mass.:
745.952
SMILES:
Cc1nc(C)c(COc2ccc(CC(O)C(=O)NCCCCCCNc3c4CCCCc4nc4ccccc34)cc2OCc2nc(C)c(C)nc2C)nc1C
: