Target
Mu-type opioid receptor
Ligand
BDBM50092176
Substrate
Meas. Tech.
ChEMBL_1762406 (CHEMBL4197653)
Ki
1.8±n/a nM
Citation
 Turnaturi, RMarrazzo, AParenti, CPasquinucci, L Benzomorphan scaffold for opioid analgesics and pharmacological tools development: A comprehensive review. Eur J Med Chem 148:410-422 (2018)  
Target
Name:
Mu-type opioid receptor
Synonyms:
M-OR-1 Mu opioid receptor OPIATE Mu OPRM_CAVPO
Type:
Enzyme Catalytic Domain
Mol. Mass.:
11165.58
Organism:
GUINEA PIG
Description:
P97266
Residue:
98
  
Inhibitor
Name:
BDBM50092176
Synonyms:
3-Cyclopropylmethyl-6,11-dimethyl-1,2,3,4,5,6-hexahydro-2,6-methano-benzo[d]azocin-8-ylamine | CHEMBL332017
Type:
Small organic molecule
Emp. Form.:
C18H26N2
Mol. Mass.:
270.4124
SMILES:
C[C@H]1[C@H]2Cc3ccc(N)cc3[C@@]1(C)CCN2CC1CC1
: