Target
Epithelial discoidin domain-containing receptor 1
Ligand
BDBM347342
Substrate
Meas. Tech.
ChEMBL_1764329 (CHEMBL4199576)
Kd
40±n/a nM
Citation
 Schenck Eidam, HRussell, JRaha, KDeMartino, MQin, DGuan, HAZhang, ZZhen, GYu, HWu, CPan, YJoberty, GZinn, NLaquerre, SRobinson, SWhite, AGiddings, AMohammadi, EGreenwood-Van Meerveld, BOliff, AKumar, SCheung, M Discovery of a First-in-Class Gut-Restricted RET Kinase Inhibitor as a Clinical Candidate for the Treatment of IBS. ACS Med Chem Lett 9:623-628 (2018)  
Target
Name:
Epithelial discoidin domain-containing receptor 1
Synonyms:
2.7.10.1 CD_antigen=CD167a DDR1_RAT Discoidin receptor tyrosine kinase Epithelial discoidin domain receptor 1 Protein-tyrosine kinase 3 Tyrosine kinase DDR | Tyrosine-protein kinase CAK
Type:
PROTEIN
Mol. Mass.:
101163.56
Organism:
Rattus norvegicus
Description:
ChEMBL_118104
Residue:
910
  
Inhibitor
Name:
BDBM347342
Synonyms:
2-(4-(4-Ethoxy-6-oxo-1,6-dihydropyridin-3-yl)-2-fluorophenyl)-N-(5-(1,1,1-trifluoro-2-methylpropan-2-yl)isoxazol-3-yl)acetamide | US9789100, Example 30
Type:
Small organic molecule
Emp. Form.:
C22H21F4N3O4
Mol. Mass.:
467.4135
SMILES:
CCOc1cc(=O)[nH]cc1-c1ccc(CC(=O)Nc2cc(on2)C(C)(C)C(F)(F)F)c(F)c1
: