Target
Proto-oncogene tyrosine-protein kinase receptor Ret
Ligand
BDBM50458625
Substrate
Meas. Tech.
ChEMBL_1764323 (CHEMBL4199570)
IC50
0.100000±n/a nM
Citation
 Schenck Eidam, HRussell, JRaha, KDeMartino, MQin, DGuan, HAZhang, ZZhen, GYu, HWu, CPan, YJoberty, GZinn, NLaquerre, SRobinson, SWhite, AGiddings, AMohammadi, EGreenwood-Van Meerveld, BOliff, AKumar, SCheung, M Discovery of a First-in-Class Gut-Restricted RET Kinase Inhibitor as a Clinical Candidate for the Treatment of IBS. ACS Med Chem Lett 9:623-628 (2018)  
Target
Name:
Proto-oncogene tyrosine-protein kinase receptor Ret
Synonyms:
CDHF12 Cadherin family member 12 Proto-oncogene c-Ret RET51 Tyrosine-protein kinase Ret (RET)
Type:
Protein
Mol. Mass.:
124318.29
Organism:
Homo sapiens (Human)
Description:
P07949
Residue:
1114
  
Inhibitor
Name:
BDBM50458625
Synonyms:
CHEMBL4218013
Type:
Small organic molecule
Emp. Form.:
C28H31F4N5O3
Mol. Mass.:
561.5711
SMILES:
CCOc1cc(c[nH]c1=O)-c1ccc(NC(=O)Nc2ccc(CN3CCN(CC)CC3)c(c2)C(F)(F)F)c(F)c1
: