Target
Vascular endothelial growth factor receptor 2
Ligand
BDBM50458631
Substrate
Meas. Tech.
ChEMBL_1764324 (CHEMBL4199571)
IC50
1830±n/a nM
Citation
 Schenck Eidam, HRussell, JRaha, KDeMartino, MQin, DGuan, HAZhang, ZZhen, GYu, HWu, CPan, YJoberty, GZinn, NLaquerre, SRobinson, SWhite, AGiddings, AMohammadi, EGreenwood-Van Meerveld, BOliff, AKumar, SCheung, M Discovery of a First-in-Class Gut-Restricted RET Kinase Inhibitor as a Clinical Candidate for the Treatment of IBS. ACS Med Chem Lett 9:623-628 (2018)  
Target
Name:
Vascular endothelial growth factor receptor 2
Synonyms:
CD_antigen=CD309 Fetal liver kinase 1 (FLK-1) KDR Protein-tyrosine kinase receptor Flk-1 VEGFR-2 VEGFR2 Vascular Endothelial Growth Factor Receptor Kinase 2 Vascular endothelial growth factor receptor 2 (KDR) Vascular endothelial growth factor receptor 2 (VEGFR2) Vascular endothelial growth factor receptor-2 (VEGFR-2)
Type:
Receptor Tyrosine Kinase
Mol. Mass.:
151510.97
Organism:
Homo sapiens (Human)
Description:
P35968
Residue:
1356
  
Inhibitor
Name:
BDBM50458631
Synonyms:
CHEMBL4209229
Type:
Small organic molecule
Emp. Form.:
C25H24F5N3O3
Mol. Mass.:
509.4684
SMILES:
CCOc1cc(=O)[nH]cc1-c1ccc(CC(=O)Nc2cc(cc(CN(C)C)c2F)C(F)(F)F)c(F)c1
: