Target
Proto-oncogene tyrosine-protein kinase receptor Ret
Ligand
BDBM50458629
Substrate
Meas. Tech.
ChEMBL_1764323 (CHEMBL4199570)
IC50
1.2±n/a nM
Citation
 Schenck Eidam, HRussell, JRaha, KDeMartino, MQin, DGuan, HAZhang, ZZhen, GYu, HWu, CPan, YJoberty, GZinn, NLaquerre, SRobinson, SWhite, AGiddings, AMohammadi, EGreenwood-Van Meerveld, BOliff, AKumar, SCheung, M Discovery of a First-in-Class Gut-Restricted RET Kinase Inhibitor as a Clinical Candidate for the Treatment of IBS. ACS Med Chem Lett 9:623-628 (2018)  
Target
Name:
Proto-oncogene tyrosine-protein kinase receptor Ret
Synonyms:
CDHF12 Cadherin family member 12 Proto-oncogene c-Ret RET51 Tyrosine-protein kinase Ret (RET)
Type:
Protein
Mol. Mass.:
124318.29
Organism:
Homo sapiens (Human)
Description:
P07949
Residue:
1114
  
Inhibitor
Name:
BDBM50458629
Synonyms:
CHEMBL4210670
Type:
Small organic molecule
Emp. Form.:
C26H28F3N5O2
Mol. Mass.:
499.528
SMILES:
CCN1CCN(Cc2ccc(NC(=O)Nc3ccc(cc3)-c3ccc(=O)[nH]c3)cc2C(F)(F)F)CC1
: