Target
Endothelial lipase
Ligand
BDBM50458640
Substrate
Meas. Tech.
ChEMBL_1764452 (CHEMBL4199699)
IC50
100±n/a nM
Citation
 Hangeland, JJAbell, LMAdam, LPJiang, JFriends, TJHaque, LENeels, JOnorato, JMChen, AYATaylor, DSYin, XHarrity, TWBasso, MDYang, RSleph, PGGordon, DAHuang, CSWexler, RRFinlay, HJLawrence, RM PK/PD Disconnect Observed with a Reversible Endothelial Lipase Inhibitor. ACS Med Chem Lett 9:673-678 (2018)  
Target
Name:
Endothelial lipase
Synonyms:
EDL Endothelial lipase LIPE_MOUSE | Lipg
Type:
Protein
Mol. Mass.:
56643.58
Organism:
Mus musculus (Mouse)
Description:
Q9WVG5
Residue:
500
  
Inhibitor
Name:
BDBM50458640
Synonyms:
CHEMBL4203934
Type:
Small organic molecule
Emp. Form.:
C17H20Cl2N2O3
Mol. Mass.:
371.258
SMILES:
CCN1CC(C(=O)NC(C)CCc2ccc(Cl)c(Cl)c2)=C(O)C1=O
: